{"text_format":"1","workbook":"xlsx","n_sheets":7,"sheets":["Instructions","Server Efficiency","Startup Server Efficiency","Electrical System Efficiency","Qualified Product List","Case Definition","Summary"],"not_rendered":{"charts":7,"images":1,"macros":1,"external_links":0,"defined_names":23,"comments":4,"pivot_tables":0},"unopened":[],"bounds":{"document_bytes":16777216,"sheet_cells":100000,"rows_first":2000,"rows_last":500,"rows_between":2000,"halvings":0,"cell_chars":16384,"cell_head_chars":4096},"cells_cut":0,"cells_raw":0,"read":"whole","date_system":"1900"}

{"sheet":"Instructions","index":0,"n_rows":75,"n_cols":18,"rows_kept":75,"cut":false,"hidden":false,"merged":[[22,4,22,5],[24,4,24,5],[26,4,26,5],[28,4,28,5],[7,4,7,7],[9,4,9,7],[10,4,10,7],[18,4,18,7],[20,4,20,5],[2,4,2,7],[15,4,15,6],[58,4,58,7],[32,4,32,5],[35,4,35,7],[37,4,37,7],[39,4,39,7],[41,4,41,7],[44,4,44,7],[46,4,46,7],[48,4,48,7],[51,4,51,7],[54,4,54,7],[56,4,56,7],[30,4,30,5],[5,4,5,7]]}
[]
[]
[null,null,null,null,"Minimum Energy Performance Data Center Calculator\nLEED 2009 and LEED v4 - EA Prerequisite Minimum Energy Performance and EA Credit Optimize Energy Performance"]
[]
[null,null,null,null,"General Information"]
[null,null,null,null,"This calculator is provided to assist data center project teams in the documentation of IT Server energy and Electrical System Efficiency savings.  For all data center projects where savings is being claimed from the IT Systems or the Electrical Systems, supporting documentation must be provided to demonstrate that all strategies/technologies being claimed are being employed within the data center. This calculator may be used as supporting documentation to justify savings related to IT systems or electrical systems. The calculator creates a representative baseline for most data center topologies and IT systems.  Since this calculator will not create a representative baseline for every data center application, project teams are still welcome to create their own Baseline, but in this case the project team is responsible to provide justification for all Baseline assumptions used.  By using this calculator, project teams are not required to define their own baseline, or provide justification for the Baseline IT and electrical assumptions. \n\nSince it is well known that many data center projects do not know the exact types of IT equipment that will be used in their data center until well after the end of construction, this calculator can provide default values for many of these systems. "]
[]
[null,null,null,null,"The results from this calculator may be used in one of two ways:\n\n  "]
[]
[null,null,null,null,"1. The calculated energy savings from the IT and Electrical Systems will be calculated in kWh and can be directly claimed without needing to run another energy model. This approach is simpler, in that no additional energy models are required, but it will likely lead to a conservative estimate of savings since it does not show the HVAC savings associated with lower IT and electrical loads."]
[null,null,null,null,"2. The calculated electrical load for the Baseline IT and Electrical Systems can be used as inputs to an exceptional calculation method, where the Baseline Case model is revised to show the Baseline IT and electrical loads from this calculator. This approach requires additional energy modeling, and additional efforts to report the outputs in the LEED calculator/forms, but will lead to a more accurate estimate of savings, since it will calculate the HVAC savings associated with the lower IT and electrical loads."]
[]
[null,null,null,null,"Instructions"]
[null,null,null,null,"Step 1."]
[null,null,null,null,"Enable macros."]
{"$rows_left_out":61}
{"sheet":"Server Efficiency","index":1,"n_rows":77,"n_cols":32,"rows_kept":77,"cut":false,"hidden":false,"merged":[[76,1,76,6],[73,1,74,1],[73,2,73,6],[74,2,74,6],[66,1,66,6],[67,1,67,6],[68,1,68,6],[69,1,69,6],[70,1,70,6],[71,1,71,6],[6,9,7,9],[51,1,52,1],[62,1,63,1],[62,2,62,6],[63,2,63,6],[55,1,55,6],[56,1,56,6],[57,1,57,6],[58,1,58,6],[59,1,59,6],[33,1,34,9],[37,1,38,9],[41,1,42,9],[22,1,22,6],[24,1,24,6],[60,1,60,6],[51,2,51,6],[52,2,52,6],[49,1,49,6],[28,12,29,12],[46,1,46,6],[47,1,47,6],[26,1,26,6],[28,1,28,6],[30,1,30,6],[48,1,48,6],[6,28,7,28],[18,22,30,31],[10,30,11,30],[10,31,11,31],[12,22,13,22],[6,30,7,30],[6,31,7,31],[8,29,9,29],[8,30,9,30],[8,31,9,31],[6,25,7,25],[6,26,7,26],[6,29,7,29],[6,22,7,22],[8,22,9,22],[10,22,11,22],[6,23,7,23],[6,24,7,24],[10,23,11,23],[10,24,11,24],[10,28,11,28],[10,29,11,29],[8,23,9,23],[8,24,9,24],[8,25,9,25],[8,26,9,26],[8,27,9,27],[8,28,9,28],[6,27,7,27],[12,23,13,23],[12,24,13,24],[12,25,13,25],[12,26,13,26],[12,27,13,27],[12,28,13,28],[12,29,13,29],[12,30,13,30],[12,31,13,31],[10,25,11,25],[10,26,11,26],[10,27,11,27]]}
[]
[null,"IT (Server) Equipment Efficiency"]
[]
[]
[null,"Proposed IT (Server) Energy Usage",null,null,null,null,null,null,null,null,null,null,"Baseline IT Energy Usage",null,null,null,null,"Summary"]
[]
[null,"Proposed IT",null,null,null,"Proposed IT influenced by project",null,null,null,"Outside project scope",null,null,"Average server utilization (%)",null,0.12,null,null,"Baseline IT energy consumption (kWh)",{"$f":"IFERROR(O23+(D9-H15-J15)*8760, 0)","v":0},null,null,null,"Utilization",0.12,{"$f":"Z7-(($AF$7-$X$7)/8)","v":0.16750000000000009},0.21500000000000008,0.26250000000000007,0.31000000000000005,0.35750000000000004,0.40500000000000003,0.45250000000000001,0.5]
[]
[null,"Total IT equipment (kW)",null,{"$f":"Instructions!$H$23","v":0},null,"Influenced by project (kW)",null,{"$f":"Instructions!$H$23*Instructions!$H$25","v":0},null,null,null,null,"Baseline server virtualization (%)",null,0.2,null,null,"Proposed IT energy consumption (kWh)",{"$f":"IFERROR(O25+(D9-H15-J15)*8760, 0)","v":0},null,null,null,"Workloads",1,{"$f":"Z9-(($AF$9-1)/8)","v":0.875},{"$f":"AA9-(($AF$9-$X$9)/8)","v":0.75},0.625,0.5,0.375,0.25,0.125,{"$f":"'Server Efficiency'!H27","v":0}]
[]
[null,"Total compute (%)",null,null,null,"Total compute (kW)",null,{"$f":"D11*H9","v":0},null,{"$f":"IFERROR($D$9*(1-$H$9/$D$9)*D11,0)","v":0},null,null,"Equivalent number of servers based on proposed conditions",null,{"$f":"IFERROR(TRUNC((IF(J33,H50,IF(J41,H72,H61)))/(10*O9+(1-O9))), \"\")","v":0},null,null,"Average annual IT energy savings (%)",{"$f":"IFERROR(IF(S9>0,((S7-S9)/S7),0), \"\")","v":0},null,null,null,"Machines",{"$f":"AF9","v":0},{"$f":"AE9","v":0.125},{"$f":"AD9","v":0.25},{"$f":"AC9","v":0.375},{"$f":"AB9","v":0.5},{"$f":"AA9","v":0.625},{"$f":"Z9","v":0.75},{"$f":"Y9","v":0.875},{"$f":"X9","v":1}]
[]
[null,"Mainframe/other (%)",null,null,null,"Mainframe/other (kW)",null,{"$f":"D13*H11","v":0},null,{"$f":"D13*$J$11","v":0},null,null,"EPA Qualified Product List for Servers",null,null,null,null,null,null,null,null,null,"Reduction in Machines",{"$f":"IFERROR(1-X11/$X$11,0)","v":0},0,0,0,0,0,0,0,0]
[]
[null,"Servers (%)",null,null,null,"Servers (kW)",null,{"$f":"D15*H11","v":0},null,{"$f":"D15*$J$11","v":0},null,null,"Average maximum power (watts)",null,{"$f":"'Qualified Product List'!$AP$140","v":210.21526717557251}]
{"$rows_left_out":63}
{"sheet":"Startup Server Efficiency","index":2,"n_rows":69,"n_cols":15,"rows_kept":69,"cut":false,"hidden":false,"merged":[[65,1,66,1],[65,2,65,6],[66,2,66,6],[68,1,68,6],[28,12,29,12],[58,1,58,6],[59,1,59,6],[60,1,60,6],[61,1,61,6],[62,1,62,6],[63,1,63,6],[49,1,49,6],[50,1,50,6],[51,1,51,6],[52,1,52,6],[54,1,55,1],[30,1,30,6],[54,2,54,6],[55,2,55,6],[41,1,41,6],[43,1,44,1],[43,2,43,6],[44,2,44,6],[47,1,47,6],[48,1,48,6],[38,1,38,6],[39,1,39,6],[40,1,40,6],[6,9,7,9],[22,1,22,6],[24,1,24,6],[26,1,26,6],[28,1,28,6]]}
[]
[null,"Startup IT (Server) Equipment Efficiency"]
[]
[]
[null,"Proposed Startup IT Energy Usage",null,null,null,null,null,null,null,null,null,null,"Baseline Startup IT Energy Usage"]
[]
[null,"Proposed Startup IT",null,null,null,"Proposed IT influenced by project",null,null,null,"Outside project scope",null,null,"Average server utilization (%)",null,0.12]
[]
[null,"Total startup IT equipment (kW)",null,{"$f":"Instructions!H27","v":0},null,"Influenced by project (kW)",null,{"$f":"IF(D9<=Instructions!$H$23*Instructions!$H$25,D9,Instructions!$H$23*Instructions!$H$25)","v":0},null,null,null,null,"Baseline server virtualization (%)",null,0.2]
[]
[null,"Total compute (%)",null,{"$f":"'Server Efficiency'!$D$11","v":0},null,"Total compute (kW)",null,{"$f":"D11*H9","v":0},null,{"$f":"IFERROR($D$9*(1-$H$9/$D$9)*D11,0)","v":0},null,null,"Equivalent number of servers based on proposed conditions",null,{"$f":"IFERROR(TRUNC((IF(J33,H42,IF(J35,H64,H53)))/(10*O9+(1-O9))), \"\")","v":0}]
[]
[null,"Mainframe/other (%)",null,{"$f":"'Server Efficiency'!$D$13","v":0},null,"Mainframe/other (kW)",null,{"$f":"D13*H11","v":0},null,{"$f":"D13*$J$11","v":0},null,null,"EPA Qualified Product List for Servers"]
[]
[null,"Servers (%)",null,{"$f":"'Server Efficiency'!$D$15","v":0},null,"Servers (kW)",null,{"$f":"D15*H11","v":0},null,{"$f":"D15*$J$11","v":0},null,null,"Average maximum power (watts)",null,{"$f":"'Qualified Product List'!$AP$140","v":210.21526717557251}]
{"$rows_left_out":55}
{"sheet":"Electrical System Efficiency","index":3,"n_rows":99,"n_cols":25,"rows_kept":99,"cut":false,"hidden":false,"merged":[[23,21,30,24],[10,2,11,8],[8,2,9,8],[15,3,15,8],[17,3,17,8],[15,13,15,18],[17,13,17,18]]}
[]
[null,"Electrical System Efficiency"]
[]
[]
[null,"Proposed Electrical System Efficiency",null,null,null,null,null,null,null,null,null,"Baseline Electrical System Efficiency",null,null,null,null,null,null,null,null,null,"Baseline and Proposed Case Comparison"]
[]
[null,"Select one of the following:",null,null,null,null,null,null,null,null,null,"Select all that apply.  The following components are included in analysis:",null,null,null,null,null,null,null,null,null,"Baseline annual energy use (kWh)",null,null,{"$f":"Q31*8760","v":0}]
[]
[null,null,"Default efficiency values.  \nUtilizes the USGBC-provided efficiency values for all components included in the analysis.  ",null,null,null,null,null,null,null,null,null,"PDUs with STS",true,"UPS",true,"Switchgear",true,"Mains Transformer",null,null,"Proposed annual energy use (kWh)",null,null,{"$f":"IF(B13=1,G31*8760,G50*8760)","v":0}]
[]
[null,null,"User-provided data.  \nEnter the efficiency values at 25%, 50%, 75%, and 100% of the design IT load.  Make sure to include the efficiency for all components included in the analysis and provide supporting documentation for the efficiency values of all components.",null,null,null,null,null,null,null,null,null,"PDUs without STS",true,"Generator",true,"Distribution Wiring",null,null,null,null,"Startup annual energy use (kWh)",null,null,{"$f":"IF(B13=1,G33*8760,G52*8760)","v":0}]
[null,null,null,null,null,null,null,null,null,null,null,1]
[null,1]
[null,"Total IT load (kW)",null,null,null,null,null,null,{"$f":"'Server Efficiency'!D9","v":0},null,null,"Total IT load (kW)",null,null,null,null,null,null,{"$f":"IFERROR('Server Efficiency'!S7/8760,\"\")","v":0},null,null,"Annual energy savings (kWh)",null,null,{"$f":"Y7-Y9","v":0}]
[]
{"$rows_left_out":85}
{"sheet":"Qualified Product List","index":4,"n_rows":155,"n_cols":46,"rows_kept":155,"cut":false,"hidden":false,"merged":[[141,7,141,8],[141,4,141,6]]}
[]
[null,null,"ENERGY STAR Computer Server Qualified Product List"]
[null,null,"List Current as of May 06, 2013",null,null,{"$f":"RIGHT(C3,12)","v":"May 06, 2013"}]
[]
[null,null,"Includes all ENERGY STAR qualified models submitted to the EPA, including models that may not be available in the U.S. "]
[null,null,"Note: The ENERGY STAR Computer Server Qualified Product List includes a limited amount of information on qualified computer server configurations.  For more information on qualified models / configurations, please refer to the ENERGY STAR Power and Performance"]
[null,null,null,null,null,null,null,null,null,null,null,null,null,null,null,null,null,null,null,null,null,null,null,null,null,null,null,null,null,null,null,null,null,null,null,null,null,null,null,null,null,null,null,null,"Pn = Pidle + (Pmax – Pidle) / 100 * n"]
[null,"PD_ID","Product (Unit) Type","\nPartner Name","Brand","Model Name","Model Number","Product Type","Product Form Factor","Service Processor Installed","Available Processor Sockets","Number of Installed Processors","Processor Brand","Processor Name","Processor Speed","System Memory ","Number of Hard Drives","Total Installed Storage Capacity","Power Supply Rated Output","Power Supplies Installed","Power Supplies Installed for Redundancy","Operating System Name Used for Testing","Available Power Saving Features","Enabled Power Saving Features","Power Supply Efficiency @ 10% Load","Power Supply Efficiency @ 20% Load","Power Supply Efficiency @ 50% Load","Power Supply Efficiency @ 100% Load","Power Factor @ 10% Load","Power Factor @ 20% Load","Power Factor @ 50% Load","Power Factor @ 100% Load","Idle Power Draw @ 230V ","Idle Power Draw @115V","Idle Power Draw @100V","Idle Power Draw @+/-53V DC","Full Load Testing Voltage / Frequency ","Full Power Load","Date Available on Market","Date Qualified","Min \nEnergy","Max \nEnergy","Power \nSupply","Max Energy as a Percent of Power Supply","Power at % Utilization (n) - Base Case","Power at % Utilization (n) - Proposed Case"]
[null,null,"Server","Acer Incorporated","Acer","AR360 F2","AR360 F2_1","3 or 4 Socket Server","Other","Yes","2","2","Intel","Xeon E5-2670",null,null,"2",null,"750","1",null,"Windows Server 2008 R2 Standard","Variable speed fan control based on power or thermal readings,Power capping,Low power memory states,Low power I/O states,Other,Processor or core reduced power states,Dynamic voltage and frequency scaling of processor(s)","Variable speed fan control based on power or thermal readings,Power capping,Low power memory states,Low power I/O states,Other,Processor or core reduced power states,Dynamic voltage and frequency scaling of processor(s)","0.81","0.86","0.89","0.87","0.8","0.89","0.95","0.98","67.6",null,null,null,"230 Vac, 50 Hz","104.2","2012-09-01","2012-09-18",{"$f":"VALUE(LEFT(AG9,3))","v":67},{"$f":"VALUE(LEFT(AL9,4))","v":104},{"$f":"VALUE(LEFT(S9,4))","v":750},{"$f":"AP9/AQ9","v":0.13866666666666666},{"$f":"$AO9+($AP9-$AO9)/100*'Server Efficiency'!$O$7","v":67.044399999999996},{"$f":"$AO9+($AP9-$AO9)/100*'Server Efficiency'!$H$25","v":67}]
[null,null,"Server","Acer Incorporated","Acer","AR360 F2","AR360 F2_2","1 or 2 Socket Server","Other","Yes","2","2","Intel","Xeon E5-2650",null,null,"2",null,"750","1",null,"Windows Server 2008 R2 Standard","Variable speed fan control based on power or thermal readings,Power capping,Low power memory states,Low power I/O states,Other,Processor or core reduced power states,Dynamic voltage and frequency scaling of processor(s)","Variable speed fan control based on power or thermal readings,Power capping,Low power memory states,Low power I/O states,Other,Processor or core reduced power states,Dynamic voltage and frequency scaling of processor(s)","0.81","0.86","0.89","0.87","0.8","0.89","0.95","0.98","68.93",null,null,null,"230 Vac, 50 Hz","87.2","2012-09-01","2012-09-18",{"$f":"VALUE(LEFT(AG10,3))","v":68},{"$f":"VALUE(LEFT(AL10,4))","v":87.2},{"$f":"VALUE(LEFT(S10,4))","v":750},{"$f":"AP10/AQ10","v":0.11626666666666667},{"$f":"$AO10+($AP10-$AO10)/100*'Server Efficiency'!$O$7","v":68.023039999999995},{"$f":"$AO10+($AP10-$AO10)/100*'Server Efficiency'!$H$25","v":68}]
[null,null,"Server","Acer Incorporated","Acer","AR360 F2","AR360 F2_3","1 or 2 Socket Server","Other","Yes","2","2","Intel","Xeon E5-2620",null,null,"2",null,"750","1",null,"Windows Server 2008 R2 Standard","Variable speed fan control based on power or thermal readings,Power capping,Low power memory states,Low power I/O states,Other,Processor or core reduced power states,Dynamic voltage and frequency scaling of processor(s)","Variable speed fan control based on power or thermal readings,Power capping,Low power memory states,Low power I/O states,Other,Processor or core reduced power states,Dynamic voltage and frequency scaling of processor(s)","0.81","0.86","0.89","0.87","0.8","0.89","0.95","0.98","72.34",null,null,null,"230 Vac, 50 Hz","90.18","2012-09-01","2012-09-18",{"$f":"VALUE(LEFT(AG11,3))","v":72},{"$f":"VALUE(LEFT(AL11,4))","v":90.1},{"$f":"VALUE(LEFT(S11,4))","v":750},0.12013333333333333,{"$f":"$AO11+($AP11-$AO11)/100*'Server Efficiency'!$O$7","v":72.021720000000002},{"$f":"$AO11+($AP11-$AO11)/100*'Server Efficiency'!$H$25","v":72}]
[null,null,"Server","Acer Incorporated","Acer","AR380 F2","AR380 F2_1","1 or 2 Socket Server","Rackmount","Yes","2","2","Intel","Xeon E5-2690",null,null,"2",null,"920","1",null,"Windows Server 2008 R2 Standard","Variable speed fan control based on power or thermal readings,Power capping,Low power memory states,Low power I/O states,Other,Processor or core reduced power states,Dynamic voltage and frequency scaling of processor(s)","Variable speed fan control based on power or thermal readings,Power capping,Low power memory states,Low power I/O states,Other,Processor or core reduced power states,Dynamic voltage and frequency scaling of processor(s)","0.8","0.88","0.91","0.88","0.93","0.96","0.98","0.99","133.3",null,null,null,"230 Vac, 50 Hz","170.0","2012-09-01","2012-09-19",133,170,920,0.18478260869565216,{"$f":"$AO12+($AP12-$AO12)/100*'Server Efficiency'!$O$7","v":133.0444},{"$f":"$AO12+($AP12-$AO12)/100*'Server Efficiency'!$H$25","v":133}]
[null,null,"Server","Acer Incorporated","Acer","AR380 F2","AR380 F2_2","1 or 2 Socket Server","Rackmount","Yes","2","2","Intel","Xeon E5-2650",null,null,"2",null,"920","1",null,"Windows Server 2008 R2 Standard","Variable speed fan control based on power or thermal readings,Power capping,Low power memory states,Low power I/O states,Other,Processor or core reduced power states,Dynamic voltage and frequency scaling of processor(s)","Variable speed fan control based on power or thermal readings,Power capping,Low power memory states,Low power I/O states,Other,Processor or core reduced power states,Dynamic voltage and frequency scaling of processor(s)","0.8","0.88","0.91","0.88","0.93","0.96","0.98","0.99","130.2",null,null,null,"230 Vac, 50 Hz","154.5","2012-09-01","2012-09-19",130,154,920,0.16739130434782609,{"$f":"$AO13+($AP13-$AO13)/100*'Server Efficiency'!$O$7","v":130.02879999999999},{"$f":"$AO13+($AP13-$AO13)/100*'Server Efficiency'!$H$25","v":130}]
[null,null,"Server","Acer Incorporated","Acer","AR380 F2","AR380 F2_3","1 or 2 Socket Server","Rackmount","Yes","2","2","Intel","Xeon E5-2620",null,null,"2",null,"920","1",null,"Windows Server 2008 R2 Standard","Variable speed fan control based on power or thermal readings,Power capping,Low power memory states,Low power I/O states,Other,Processor or core reduced power states,Dynamic voltage and frequency scaling of processor(s)","Variable speed fan control based on power or thermal readings,Power capping,Low power memory states,Low power I/O states,Other,Processor or core reduced power states,Dynamic voltage and frequency scaling of processor(s)","0.8","0.88","0.91","0.88","0.93","0.96","0.98","0.99","134.7",null,null,null,"230 Vac, 50 Hz","155.7","2012-09-01","2012-09-19",134,155,920,0.16847826086956522,{"$f":"$AO14+($AP14-$AO14)/100*'Server Efficiency'!$O$7","v":134.02520000000001},{"$f":"$AO14+($AP14-$AO14)/100*'Server Efficiency'!$H$25","v":134}]
[null,null,"Server","Acer Incorporated","Acer","AT350 F2","AT350 F2_1","1 or 2 Socket Server","Tower/Pedestal","Yes","2","2","Intel","Xeon E5-2690",null,null,"2",null,"920","1",null,"Windows Server 2008 R2 Standard","Variable speed fan control based on power or thermal readings,Power capping,Low power memory states,Low power I/O states,Other,Processor or core reduced power states,Dynamic voltage and frequency scaling of processor(s)","Variable speed fan control based on power or thermal readings,Power capping,Low power memory states,Low power I/O states,Other,Processor or core reduced power states,Dynamic voltage and frequency scaling of processor(s)","0.8","0.88","0.91","0.88","0.93","0.96","0.98","0.99","121.1",null,null,null,"230 Vac, 50 Hz","125.5","2012-07-01","2012-09-18",121,125,920,0.1358695652173913,{"$f":"$AO15+($AP15-$AO15)/100*'Server Efficiency'!$O$7","v":121.0048},{"$f":"$AO15+($AP15-$AO15)/100*'Server Efficiency'!$H$25","v":121}]
{"$rows_left_out":141}
{"sheet":"Case Definition","index":5,"n_rows":43,"n_cols":9,"rows_kept":43,"cut":false,"hidden":false,"merged":[[25,6,25,8],[5,6,5,8],[20,6,20,8],[40,6,40,8],[5,1,6,1],[5,2,6,2],[5,3,6,3],[5,4,6,4],[5,5,6,5],[25,1,26,1],[25,2,26,2],[25,3,26,3],[25,4,26,4],[25,5,26,5]]}
[]
[null,"Case Definition"]
[null,null,null,null,null,{"$f":"RIGHT(B3,12)","v":""}]
[]
[null,"Baseline Case Definition"]
[null,"Standard","Type","Size","Allowances","Voltage","Coefficients"]
[null,null,null,null,null,null,"X2","X1","X0"]
[null,{"$f":"CONCATENATE(C8,D8)","v":"Double Conversion (VFI-S)10<20kVA"},"Double Conversion (VFI-S)","10<20kVA","None","400Y/230Vac",3.8315534405051088E-2,1.611372912606146E-2,4.4626750732631865E-2]
[null,{"$f":"CONCATENATE(C9,D9)","v":"Double Conversion (VFI-S)20<40kVA"},"Double Conversion (VFI-S)","20<40kVA","None","400Y/230Vac",3.0720721718065815E-2,2.2138293065117779E-2,4.0100794662796715E-2]
[null,"Double Conversion (VFI-S)40<200kVA","Double Conversion (VFI-S)","40<200kVA","None","400Y/230Vac",3.3081134519764695E-2,2.1268080072313272E-2,3.2120028630975621E-2]
[null,"Double Conversion (VFI-S)200kVA and up","Double Conversion (VFI-S)","200kVA and up","None","400Y/230Vac",2.4951279344017765E-2,2.7244170593209997E-2,2.2800873032132008E-2]
[null,"Line Interactive (VI-S)10<20kVA","Line Interactive (VI-S)","10<20kVA","None","400Y/230Vac",4.3531673966456609E-2,8.9066339066338155E-3,2.8893147099668847E-2]
[null,"Line Interactive (VI-S)20<40kVA","Line Interactive (VI-S)","20<40kVA","None","400Y/230Vac",4.3050157866997701E-2,3.8912614090305807E-3,2.8574911707771211E-2]
[null,"Line Interactive (VI-S)40<200kVA","Line Interactive (VI-S)","40<200kVA","None","400Y/230Vac",4.2576587786915497E-2,-1.0750749935877714E-3,2.8261906100210715E-2]
[null,"Line Interactive (VI-S)200kVA and up","Line Interactive (VI-S)","200kVA and up","None","400Y/230Vac",3.4695116662329682E-2,4.4236273744472443E-3,1.9516003122560448E-2]
{"$rows_left_out":29}
{"sheet":"Summary","index":6,"n_rows":34,"n_cols":10,"rows_kept":34,"cut":false,"hidden":false,"merged":[[23,2,23,9]]}
[]
[]
[null,null,"Summary "]
[null,null,"Note: All information on this tab is READ-ONLY. To edit, see the previous tabs."]
[]
[]
[]
[null,null,"Annual Energy Consumption",null,null,"Baseline",null,"Proposed",null,"Savings"]
[]
[null,null,"IT (kWh)",null,null,{"$f":"'Server Efficiency'!S7","v":0},null,{"$f":"'Server Efficiency'!S9","v":0},null,{"$f":"F10-H10","v":0}]
[]
[null,null,"Electrical System (kWh)",null,null,{"$f":"'Electrical System Efficiency'!Y7","v":0},null,{"$f":"'Electrical System Efficiency'!$Y$9","v":0},null,{"$f":"F12-H12","v":0}]
[]
[null,null,"Total (kWh)",null,null,{"$f":"SUM(F10:F12)","v":0},null,{"$f":"SUM(H10:H12)","v":0},null,{"$f":"SUM(J10:J12)","v":0}]
[]
{"$rows_left_out":19}