{"text_format":"1","workbook":"xlsx","n_sheets":11,"sheets":["Instructions","Assumptions","Background Noise","Sound Transmission (Isolation)","Reverberation Time","Noise Reduction Coefficient","Speech Privacy","Acoustical Finishes","Summary D+C","Summary SCH","Summary HC"],"not_rendered":{"charts":0,"images":1,"macros":1,"external_links":0,"defined_names":15,"comments":3,"pivot_tables":0},"unopened":[],"bounds":{"document_bytes":16777216,"sheet_cells":100000,"rows_first":2000,"rows_last":500,"rows_between":2000,"halvings":0,"cell_chars":16384,"cell_head_chars":4096},"cells_cut":0,"cells_raw":0,"read":"whole","date_system":"1900"}

{"sheet":"Instructions","index":0,"n_rows":53,"n_cols":9,"rows_kept":53,"cut":false,"hidden":false,"merged":[[46,4,46,5],[2,4,2,5],[5,4,5,5],[45,4,45,5],[13,4,13,5],[19,4,19,5],[37,4,37,5],[34,4,34,5],[20,4,20,5],[29,4,29,5]]}
[]
[]
[null,null,null,null,"Acoustic Performance Calculator\nLEED v4 EQ Prerequisite Minimum Acoustic Performance and EQ Credit Acoustic Performance"]
[]
[null,null,null,null,"Step 1."]
[null,null,null,null,"Enable macros."]
[null,null,null,null,"Note: This calculator is for use with Excel for Mac 2011 and Excel 2007 or later."]
[]
[null,null,null,null,"Step 2. "]
[null,null,null,null,"Unit of measurement","IP units"]
[null,null,null,null,"Note: This selection must match the unit of measurement chosen during project registration."]
[]
[null,null,null,null,"Step 3."]
[null,null,null,null,"Complete the following tabs:"]
[null,null,null,null,"Background Noise"]
{"$rows_left_out":39}
{"sheet":"Assumptions","index":1,"n_rows":149,"n_cols":11,"rows_kept":149,"cut":false,"hidden":false,"merged":[[5,1,6,2],[5,3,5,6],[137,3,137,4],[138,3,138,4],[124,6,124,7],[125,1,138,1],[124,3,124,4],[125,3,125,4],[126,3,126,4],[127,3,127,4],[128,3,128,4],[129,3,129,4],[130,3,130,4],[131,3,131,4],[132,3,132,4],[133,3,133,4],[134,3,134,4],[135,3,135,4],[136,3,136,4],[103,1,120,1],[75,3,75,5],[76,3,76,5],[77,3,77,5],[99,3,99,5],[63,1,79,1],[63,3,63,5],[64,3,64,5],[65,3,65,5],[66,3,66,5],[67,3,67,5],[68,3,68,5],[69,3,69,5],[70,3,70,5],[71,3,71,5],[91,3,91,5],[92,3,92,5],[78,3,78,5],[79,3,79,5],[72,3,72,5],[73,3,73,5],[74,3,74,5],[86,3,86,5],[87,3,87,5],[88,3,88,5],[85,3,85,5],[90,3,90,5],[7,1,38,1],[39,1,50,1],[54,3,54,5],[61,3,61,5],[54,1,62,1],[58,3,58,5],[59,3,59,5],[60,3,60,5],[55,3,55,5],[57,3,57,5],[80,1,99,1],[56,3,56,5],[142,1,148,1],[98,3,98,5],[97,3,97,5],[89,3,89,5],[62,3,62,5],[80,3,80,5],[81,3,81,5],[82,3,82,5],[93,3,93,5],[94,3,94,5],[95,3,95,5],[96,3,96,5],[83,3,83,5],[84,3,84,5]]}
[]
[null,"Assumptions"]
[]
[]
[null,"Background Noise"]
[null,"Space Type",null,"Sound Rating Method"]
[null,null,null,"NC/RC","dBA","dBC","RC (N)"]
[null,"2011 ASHRAE (Chapter 48, Table 1) and AHRI 885-2008 (Table 15)","Rooms with intrusion from outdoor noise sources - Traffic noise","n/a",45,70,"n/a"]
[null,null,"Rooms with intrusion from outdoor noise sources - Aircraft flyovers","n/a",45,70,"n/a"]
[null,null,"Residences, apartments, condominiums - Living areas",30,35,60,35]
[null,null,"Residences, apartments, condominiums - Bathrooms, kitchens, utility rooms",35,40,60,35]
[null,null,"Hotels/motels - Individual rooms or suites",30,35,60,35]
[null,null,"Hotels/motels - Meeting/banquet rooms",30,35,60,35]
[null,null,"Hotels/motels - Corridors and lobbies",40,45,65,45]
[null,null,"Hotels/motels - Service/support areas",40,45,65,45]
{"$rows_left_out":135}
{"sheet":"Background Noise","index":2,"n_rows":20,"n_cols":14,"rows_kept":20,"cut":false,"hidden":false,"merged":[[5,4,5,7],[5,9,5,13],[4,1,4,13],[18,2,18,12],[19,2,19,12],[18,1,19,1],[5,1,6,1],[5,2,6,2],[17,2,17,6]]}
[]
[null,"Background Noise"]
[]
[]
[null,"For New Construction, Data Centers, Warehouses and Distribution Centers, and Hospitality projects:  Complete the table to demonstrate that the background noise requirements will be met in all occupied spaces. Include background noise from all HVAC systems.  Include all acoustically critical spaces/room types or worst case combinations of room assemblies and noise sources.\n\nFor Schools projects: Complete the table to demonstrate that the background noise requirements will be met in all classrooms and other core learning spaces.  Include background noise from all HVAC systems.  Include all acoustically critical spaces/room types or worst case combinations of room assemblies and noise sources.\n\nFor Healthcare projects:  Complete the table to demonstrate that the background noise requirements will be met in all occupied spaces. Include background noise from all building mechanical-electrical-plumbing systems, air distribution systems and other noise sources under the purview of the project team.   Include all acoustically critical spaces/room types or worst case combinations of room assemblies and noise sources."]
[null,"Space ID","Space Type",null,"For all except Schools projects",null,null,null,null,"For Schools projects"]
[null,null,null,null,"Sound Rating Method","Maximum Allowed Background Noise Level","Background Noise Level","Background Noise Compliance",null,"Prerequisite\nMaximum Allowed Background Noise Level \n(dBA)","Credit\nMaximum Allowed Background Noise Level \n(dBA)","Background Noise Level (dBA)","Background Noise Level\nPrerequisite Compliance","Background Noise Level Credit Compliance"]
[{"$f":"IF(B8>=0,0,1)","v":0},null,null,null,null,{"$f":"IFERROR(VLOOKUP(C8,Assumptions!$C$7:$G$51, MATCH(E8, Assumptions!$C$7:$G$7, 0), FALSE),0)","v":0},null,{"$f":"IF(G8=\"\",\"N/A\",IF(F8>=G8,\"Yes\",\"No\"))","v":"N/A"},null,{"$f":"IF(A8>0,40,40)","v":40},{"$f":"IF(A8>0,35,35)","v":35},null,{"$f":"IF(L8=\"\",\"N/A\",IF(J8>=L8,\"Yes\",\"No\"))","v":"N/A"},{"$f":"IF(L8=\"\",\"N/A\",IF(K8>=L8,\"Yes\",\"No\"))","v":"N/A"}]
[{"$f":"IF(B9>=0,0,1)","v":0},null,null,null,null,{"$f":"IFERROR(VLOOKUP(C9,Assumptions!$C$7:$G$51, MATCH(E9, Assumptions!$C$7:$G$7, 0), FALSE),0)","v":0},null,"N/A",null,40,35,null,"N/A","N/A"]
[{"$f":"IF(B10>=0,0,1)","v":0},null,null,null,null,{"$f":"IFERROR(VLOOKUP(C10,Assumptions!$C$7:$G$51, MATCH(E10, Assumptions!$C$7:$G$7, 0), FALSE),0)","v":0},null,"N/A",null,40,35,null,"N/A","N/A"]
[0,null,null,null,null,{"$f":"IFERROR(VLOOKUP(C11,Assumptions!$C$7:$G$51, MATCH(E11, Assumptions!$C$7:$G$7, 0), FALSE),0)","v":0},null,"N/A",null,40,35,null,"N/A","N/A"]
[0,null,null,null,null,{"$f":"IFERROR(VLOOKUP(C12,Assumptions!$C$7:$G$51, MATCH(E12, Assumptions!$C$7:$G$7, 0), FALSE),0)","v":0},null,"N/A",null,40,35,null,"N/A","N/A"]
[0,null,null,null,null,{"$f":"IFERROR(VLOOKUP(C13,Assumptions!$C$7:$G$51, MATCH(E13, Assumptions!$C$7:$G$7, 0), FALSE),0)","v":0},null,"N/A",null,40,35,null,"N/A","N/A"]
[0,null,null,null,null,{"$f":"IFERROR(VLOOKUP(C14,Assumptions!$C$7:$G$51, MATCH(E14, Assumptions!$C$7:$G$7, 0), FALSE),0)","v":0},null,"N/A",null,40,35,null,"N/A","N/A"]
[0,null,null,null,null,{"$f":"IFERROR(VLOOKUP(C15,Assumptions!$C$7:$G$51, MATCH(E15, Assumptions!$C$7:$G$7, 0), FALSE),0)","v":0},null,"N/A",null,40,35,null,"N/A","N/A"]
{"$rows_left_out":6}
{"sheet":"Sound Transmission (Isolation)","index":3,"n_rows":17,"n_cols":10,"rows_kept":17,"cut":false,"hidden":false,"merged":[[16,1,16,8],[4,1,4,9]]}
[]
[null,"Sound Transmission (Isolation)"]
[]
[]
[null,"For all except Schools projects:  Complete the table to demonstrate that the sound transmission requirements will be met in all occupied spaces.  Include all acoustically critical spaces/room types or worst case combinations of room assemblies. \n\nFor Schools projects: Complete the table to demonstrate that the sound transmission requirements will be met in all classrooms and other core learning spaces.  Include all acoustically critical spaces/room types or worst case combinations of room assemblies. \n"]
[null,"Room ID","Assembly ID","Assembly \nDescription","Assembly \nLocation","Space Type","Adjacent \nSpace Type","Minimum Required \nSTC Rating","STC \nRating","Sound Transmission Compliance"]
[{"$f":"IF(B7>=0,0,1)","v":0},null,null,null,null,null,null,{"$f":"IFERROR(LOOKUP(2,1/((Assumptions!$C$55:$C$100='Sound Transmission (Isolation)'!F7)*(Assumptions!$D$55:$F$100='Sound Transmission (Isolation)'!G7)),Assumptions!$G$55:$G$100),0)","v":0},null,{"$f":"IF(ISBLANK(F7),\"N/A\",IF(AND($I7<>\"\",$I7>=H7),\"Yes\",\"No\"))","v":"N/A"}]
[{"$f":"IF(B8>=0,0,1)","v":0},null,null,null,null,null,null,{"$f":"IFERROR(LOOKUP(2,1/((Assumptions!$C$55:$C$100='Sound Transmission (Isolation)'!F8)*(Assumptions!$D$55:$F$100='Sound Transmission (Isolation)'!G8)),Assumptions!$G$55:$G$100),0)","v":0},null,{"$f":"IF(ISBLANK(F8),\"N/A\",IF(AND($I8<>\"\",$I8>=H8),\"Yes\",\"No\"))","v":"N/A"}]
[{"$f":"IF(B9>=0,0,1)","v":0},null,null,null,null,null,null,{"$f":"IFERROR(LOOKUP(2,1/((Assumptions!$C$55:$C$100='Sound Transmission (Isolation)'!F9)*(Assumptions!$D$55:$F$100='Sound Transmission (Isolation)'!G9)),Assumptions!$G$55:$G$100),0)","v":0},null,{"$f":"IF(ISBLANK(F9),\"N/A\",IF(AND($I9<>\"\",$I9>=H9),\"Yes\",\"No\"))","v":"N/A"}]
[0,null,null,null,null,null,null,{"$f":"IFERROR(LOOKUP(2,1/((Assumptions!$C$55:$C$100='Sound Transmission (Isolation)'!F10)*(Assumptions!$D$55:$F$100='Sound Transmission (Isolation)'!G10)),Assumptions!$G$55:$G$100),0)","v":0},null,"N/A"]
[0,null,null,null,null,null,null,{"$f":"IFERROR(LOOKUP(2,1/((Assumptions!$C$55:$C$100='Sound Transmission (Isolation)'!F11)*(Assumptions!$D$55:$F$100='Sound Transmission (Isolation)'!G11)),Assumptions!$G$55:$G$100),0)","v":0},null,"N/A"]
[0,null,null,null,null,null,null,{"$f":"IFERROR(LOOKUP(2,1/((Assumptions!$C$55:$C$100='Sound Transmission (Isolation)'!F12)*(Assumptions!$D$55:$F$100='Sound Transmission (Isolation)'!G12)),Assumptions!$G$55:$G$100),0)","v":0},null,"N/A"]
[0,null,null,null,null,null,null,{"$f":"IFERROR(LOOKUP(2,1/((Assumptions!$C$55:$C$100='Sound Transmission (Isolation)'!F13)*(Assumptions!$D$55:$F$100='Sound Transmission (Isolation)'!G13)),Assumptions!$G$55:$G$100),0)","v":0},null,"N/A"]
[0,null,null,null,null,null,null,{"$f":"IFERROR(LOOKUP(2,1/((Assumptions!$C$55:$C$100='Sound Transmission (Isolation)'!F14)*(Assumptions!$D$55:$F$100='Sound Transmission (Isolation)'!G14)),Assumptions!$G$55:$G$100),0)","v":0},null,"N/A"]
[null,null,null,null,null,null,null,{"$f":"IFERROR(LOOKUP(2,1/((Assumptions!$C$55:$C$100='Sound Transmission (Isolation)'!F15)*(Assumptions!$D$55:$F$100='Sound Transmission (Isolation)'!G15)),Assumptions!$G$55:$G$100),0)","v":0},null,{"$f":"IF(ISBLANK(F15),\"N/A\",IF(AND($I15<>\"\",$I15>=H15),\"Yes\",\"No\"))","v":"N/A"}]
{"$rows_left_out":3}
{"sheet":"Reverberation Time","index":4,"n_rows":24,"n_cols":19,"rows_kept":24,"cut":false,"hidden":false,"merged":[[20,14,20,15],[21,14,21,15],[22,14,22,15],[6,16,6,18],[7,16,7,18],[19,14,19,17],[6,14,6,15],[7,14,7,15],[6,8,6,9],[6,10,6,12],[7,8,7,9],[7,10,7,12],[19,8,19,11],[4,1,4,6],[6,4,7,6],[6,1,8,1],[6,2,8,2],[6,3,8,3],[20,8,20,9],[21,8,21,9],[22,8,22,9],[23,1,23,6],[19,1,19,6],[20,1,20,6],[21,1,21,6],[22,1,22,6]]}
[]
[null,"Reverberation Time"]
[]
[]
[null,"Complete the table with calculations or measurements for all acoustically critical spaces/room types or worst case combinations of room assemblies. Rooms may be grouped into a single room type if their floor assemblies, ceiling assemblies, wall assemblies and adjacent spaces are identical.  For each space, all surface materials and their associated surface area must be listed."]
[null,null,null,null,null,null,null,null,0,null,null,null,null,null,0]
[null,"Material ID","Description of Material","Manufacturer or Vendor Name","Sound Absorption Coefficient",null,null,null,"Space ID",null,null,null,null,null,"Space ID"]
[null,null,null,null,null,null,null,null,"Space and Application Type",null,null,null,null,null,"Space and Application Type"]
[null,null,null,null,"500 Hz","1000 Hz","2000 Hz",null,{"$f":"IF(Instructions!$I$50=1,\"Surface Area \n(sq ft)\",\"Surface Area \n(sq m)\")","v":"Surface Area \n(sq ft)"},"Material \nLocation","Equivalent \nSound Absorption \nat 500 Hz","Equivalent \nSound Absorption \nat 1000 Hz","Equivalent \nSound Absorption \nat 2000 Hz",null,{"$f":"IF(Instructions!$I$50=1,\"Surface Area \n(sq ft)\",\"Surface Area \n(sq m)\")","v":"Surface Area \n(sq ft)"},"Material \nLocation","Equivalent \nSound Absorption \nat 500 Hz","Equivalent \nSound Absorption \nat 1000 Hz","Equivalent \nSound Absorption \nat 2000 Hz"]
[{"$f":"IF(B10>=0,0,1)","v":0},null,null,null,null,null,null,null,null,null,{"$f":"$E10*I10","v":0},{"$f":"$F10*I10","v":0},{"$f":"$G10*I10","v":0},null,null,null,{"$f":"$E10*O10","v":0},{"$f":"$F10*O10","v":0},{"$f":"$G10*O10","v":0}]
[0,null,null,null,null,null,null,null,null,null,0,0,0,null,null,null,0,0,0]
[0,null,null,null,null,null,null,null,null,null,0,0,0,null,null,null,0,0,0]
[0,null,null,null,null,null,null,null,null,null,0,0,0,null,null,null,0,0,0]
[0,null,null,null,null,null,null,null,null,null,0,0,0,null,null,null,0,0,0]
[0,null,null,null,null,null,null,null,null,null,0,0,0,null,null,null,0,0,0]
{"$rows_left_out":10}
{"sheet":"Noise Reduction Coefficient","index":5,"n_rows":22,"n_cols":14,"rows_kept":22,"cut":false,"hidden":false,"merged":[[19,1,19,4],[20,1,20,4],[21,1,21,4],[5,1,5,4],[7,1,8,1],[7,2,8,2],[7,3,8,3],[7,4,8,4]]}
[]
[null,"Noise Reduction Coefficient"]
[null,"For Schools projects only"]
[]
[]
[null,"Complete the table. Rooms may be grouped into a single core learning space/model if their construction is identical. Only the materials that demonstrate compliance with the requirements must be listed."]
[null,null,null,null,null,null,0,null,null,0,null,null,0]
[null,"Material ID","Description of Material","Manufacturer or Vendor Name","NRC ",null,"Space ID",null,null,"Space ID",null,null,"Space ID"]
[null,null,null,null,null,null,{"$f":"IF(Instructions!$I$50=1,\"Area of \nMaterial \n(sq ft)\",\"Area of \nMaterial \n(sq m)\")","v":"Area of \nMaterial \n(sq ft)"},"NRC Compliance",null,{"$f":"IF(Instructions!$I$50=1,\"Area of \nMaterial \n(sq ft)\",\"Area of \nMaterial \n(sq m)\")","v":"Area of \nMaterial \n(sq ft)"},"NRC Compliance",null,{"$f":"IF(Instructions!$I$50=1,\"Area of \nMaterial \n(sq ft)\",\"Area of \nMaterial \n(sq m)\")","v":"Area of \nMaterial \n(sq ft)"},"NRC Compliance"]
[{"$f":"IF(B10>=0,0,1)","v":0},null,null,null,null,null,null,{"$f":"IF(G10<>\"\",IF($E10>=0.7,\"Yes\",\"No\"),\"N/A\")","v":"N/A"},null,null,{"$f":"IF(J10<>\"\",IF($E10>=0.7,\"Yes\",\"No\"),\"N/A\")","v":"N/A"},null,null,{"$f":"IF(M10<>\"\",IF($E10>=0.7,\"Yes\",\"No\"),\"N/A\")","v":"N/A"}]
[0,null,null,null,null,null,null,{"$f":"IF(G11<>\"\",IF($E11>=0.7,\"Yes\",\"No\"),\"N/A\")","v":"N/A"},null,null,{"$f":"IF(J11<>\"\",IF($E11>=0.7,\"Yes\",\"No\"),\"N/A\")","v":"N/A"},null,null,{"$f":"IF(M11<>\"\",IF($E11>=0.7,\"Yes\",\"No\"),\"N/A\")","v":"N/A"}]
[0,null,null,null,null,null,null,"N/A",null,null,"N/A",null,null,"N/A"]
[0,null,null,null,null,null,null,"N/A",null,null,"N/A",null,null,"N/A"]
[0,null,null,null,null,null,null,"N/A",null,null,"N/A",null,null,"N/A"]
[0,null,null,null,null,null,null,"N/A",null,null,"N/A",null,null,"N/A"]
{"$rows_left_out":8}
{"sheet":"Speech Privacy","index":6,"n_rows":19,"n_cols":10,"rows_kept":19,"cut":false,"hidden":false,"merged":[[19,1,19,5],[19,7,19,8],[5,1,5,9],[6,9,7,9],[18,1,18,8],[6,3,7,3],[6,5,7,5],[6,4,7,4],[6,1,7,1],[6,2,7,2],[6,8,7,8],[6,6,7,7]]}
[]
[null,"Speech Privacy "]
[null,"For Healthcare projects only"]
[]
[]
[null,"Complete the table with either calculations or measurements for all acoustically critical spaces/room types or worst case combinations of room assemblies and noise sources."]
[null,"Space \nName or ID","Space Type","Enclosed or \nOpen-plan","Speech Privacy \nGoal","Design \nCriteria","Minimum or \nMaximum \nAccepted \nValue",null,"Speech \nPrivacy \nValue","Speech \nPrivacy Compliance"]
[]
[{"$f":"IF(B9>=0,0,1)","v":0},null,null,null,null,null,{"$f":"IF(F9<>\"\",IF(H9=0,\"\",IF(F9=\"PI\",\">\",\"<\")),\"\")","v":""},{"$f":"IF(OR(ISBLANK(F9),ISBLANK(E9)),\"\",SUMIFS(Assumptions!$H$126:$H$139,Assumptions!$C$126:$C$139,D9,Assumptions!$D$126:$D$139,E9,Assumptions!$F$126:$F$139,F9))","v":""},null,{"$f":"IF(I9<>\"\",IF(F9=\"PI\",IF(I9>=H9,\"Yes\",\"No\"),IF(I9<=H9,\"Yes\",\"No\")),\"N/A\")","v":"N/A"}]
[0,null,null,null,null,null,"",{"$f":"IF(OR(ISBLANK(F10),ISBLANK(E10)),\"\",SUMIFS(Assumptions!$H$126:$H$139,Assumptions!$C$126:$C$139,D10,Assumptions!$D$126:$D$139,E10,Assumptions!$F$126:$F$139,F10))","v":""},null,"N/A"]
[0,null,null,null,null,null,"",{"$f":"IF(OR(ISBLANK(F11),ISBLANK(E11)),\"\",SUMIFS(Assumptions!$H$126:$H$139,Assumptions!$C$126:$C$139,D11,Assumptions!$D$126:$D$139,E11,Assumptions!$F$126:$F$139,F11))","v":""},null,"N/A"]
[0,null,null,null,null,null,"",{"$f":"IF(OR(ISBLANK(F12),ISBLANK(E12)),\"\",SUMIFS(Assumptions!$H$126:$H$139,Assumptions!$C$126:$C$139,D12,Assumptions!$D$126:$D$139,E12,Assumptions!$F$126:$F$139,F12))","v":""},null,"N/A"]
[0,null,null,null,null,null,"",{"$f":"IF(OR(ISBLANK(F13),ISBLANK(E13)),\"\",SUMIFS(Assumptions!$H$126:$H$139,Assumptions!$C$126:$C$139,D13,Assumptions!$D$126:$D$139,E13,Assumptions!$F$126:$F$139,F13))","v":""},null,"N/A"]
[0,null,null,null,null,null,"",{"$f":"IF(OR(ISBLANK(F14),ISBLANK(E14)),\"\",SUMIFS(Assumptions!$H$126:$H$139,Assumptions!$C$126:$C$139,D14,Assumptions!$D$126:$D$139,E14,Assumptions!$F$126:$F$139,F14))","v":""},null,"N/A"]
[0,null,null,null,null,null,"",{"$f":"IF(OR(ISBLANK(F15),ISBLANK(E15)),\"\",SUMIFS(Assumptions!$H$126:$H$139,Assumptions!$C$126:$C$139,D15,Assumptions!$D$126:$D$139,E15,Assumptions!$F$126:$F$139,F15))","v":""},null,"N/A"]
{"$rows_left_out":5}
{"sheet":"Acoustical Finishes","index":7,"n_rows":24,"n_cols":14,"rows_kept":24,"cut":false,"hidden":false,"merged":[[7,15,8,15],[5,1,5,4],[23,1,23,4],[22,1,22,4],[21,1,21,4],[7,1,9,1],[7,2,9,2],[7,3,9,3],[7,4,9,4],[20,1,20,4]]}
[]
[null,"Acoustical Finishes"]
[null,"For Healthcare projects only"]
[]
[]
[null,"Complete the table for all acoustically critical spaces/room types or worst case combinations of room assemblies. Rooms may be grouped into a single room type if their floor assemblies, ceiling assemblies, and wall assemblies are identical.  "]
[null,null,null,null,null,null,0,null,null,0,null,null,0]
[null,"Material or \nSurface ID","Description of \nMaterial or Surface","Manufacturer or \nVendor Name\n(for materials only)","NRC \n(α)",null,"Room ID",null,null,"Room ID",null,null,"Room ID"]
[null,null,null,null,null,null,"Room Type",null,null,"Room Type",null,null,"Room Type"]
[null,null,null,null,null,null,{"$f":"CONCATENATE(\"Surface Area \n\",IF(Instructions!$I$50=1,\"(sq ft)\",\"(sq m)\"))","v":"Surface Area \n(sq ft)"},"Sα",null,{"$f":"CONCATENATE(\"Surface Area \n\",IF(Instructions!$I$50=1,\"(sq ft)\",\"(sq m)\"))","v":"Surface Area \n(sq ft)"},"Sα",null,{"$f":"CONCATENATE(\"Surface Area \n\",IF(Instructions!$I$50=1,\"(sq ft)\",\"(sq m)\"))","v":"Surface Area \n(sq ft)"},"Sα"]
[{"$f":"IF(B11>=0,0,1)","v":0},null,null,null,null,null,null,{"$f":"IF(G11>0,G11*$E11,\"\")","v":""},null,null,{"$f":"IF(J11>0,J11*$E11,\"\")","v":""},null,null,{"$f":"IF(M11>0,M11*$E11,\"\")","v":""}]
[0,null,null,null,null,null,null,{"$f":"IF(G12>0,G12*$E12,\"\")","v":""},null,null,{"$f":"IF(J12>0,J12*$E12,\"\")","v":""},null,null,{"$f":"IF(M12>0,M12*$E12,\"\")","v":""}]
[0,null,null,null,null,null,null,"",null,null,"",null,null,""]
[0,null,null,null,null,null,null,"",null,null,"",null,null,""]
[0,null,null,null,null,null,null,"",null,null,"",null,null,""]
{"$rows_left_out":10}
{"sheet":"Summary D+C","index":8,"n_rows":16,"n_cols":8,"rows_kept":16,"cut":false,"hidden":false,"merged":[[2,2,2,7],[7,2,7,5]]}
[]
[]
[null,null,"Summary"]
[null,null,"Note: All information on this tab is READ-ONLY. To edit, see the previous tabs."]
[]
[null,null,"Background Noise"]
[]
[null,null,"The background noise levels in all spaces do not exceed the maximum background noise level",null,null,null,null,{"$f":"'Background Noise'!H18","v":"N/A"}]
[]
[null,null,"Sound Transmission"]
[]
[null,null,"The sound transmission requirements are met for each space",null,null,null,null,{"$f":"IF(COUNTIF('Sound Transmission (Isolation)'!17:17,\"No\"),\"No\",IF(COUNTIF('Sound Transmission (Isolation)'!17:17,\"Yes\"),\"Yes\",\"N/A\"))","v":"N/A"}]
[]
[null,null,"Reverberation Time"]
[]
{"$rows_left_out":2}
{"sheet":"Summary SCH","index":9,"n_rows":35,"n_cols":8,"rows_kept":35,"cut":false,"hidden":false,"merged":[[34,2,34,5],[30,2,30,5],[10,2,10,5],[16,2,17,5],[19,2,19,5]]}
[]
[]
[null,null,"Summary for Schools"]
[null,null,"Note: All information on this tab is READ-ONLY. To edit, see the previous tabs."]
[]
[]
[null,null,"EQ Prerequisite Minimum Acoustic Performance"]
[]
[null,null,"HVAC Background Noise"]
[]
[null,null,"The background noise levels in all spaces do not exceed 40 dBA",null,null,null,null,{"$f":"'Background Noise'!N19","v":"N/A"}]
[]
[null,null,"Reverberation Time"]
[]
[null,null,"For classrooms and core learning spaces less than 20,000 cu ft (566 cu m)"]
{"$rows_left_out":21}
{"sheet":"Summary HC","index":10,"n_rows":24,"n_cols":8,"rows_kept":24,"cut":false,"hidden":false,"merged":[[17,2,17,5]]}
[]
[]
[null,null,"Summary for Healthcare"]
[null,null,"Note: All information on this tab is READ-ONLY. To edit, see the previous tabs."]
[]
[null,null,"Option 1. Speech Privacy, Sound Isolation, and Background Noise"]
[]
[null,null,"Speech Privacy"]
[]
[null,null,"Speech privacy criteria has been met for each space",null,null,null,null,{"$f":"'Speech Privacy'!J19","v":"N/A"}]
[]
[null,null,"Sound Isolation"]
[]
[null,null,"The sound transmission requirements are met for each space",null,null,null,null,{"$f":"'Sound Transmission (Isolation)'!J17","v":"N/A"}]
[]
{"$rows_left_out":9}